Target
Beta-galactosidase
Ligand
BDBM48089
Substrate
Meas. Tech.
HTS Dose response counterscreen for assays utilizing the enzyme, b-galactosidase
EC50
14650±n/a nM
Citation
 PubChem, PC HTS Dose response counterscreen for assays utilizing the enzyme, b-galactosidase PubChem Bioassay (2009)[AID] 
Target
Name:
Beta-galactosidase
Synonyms:
BGAL_ECOLX Lactase | lacZ
Type:
PROTEIN
Mol. Mass.:
116943.87
Organism:
Escherichia coli
Description:
ChEMBL_215882
Residue:
1029
  
Inhibitor
Name:
BDBM48089
Synonyms:
(5E)-5-(4-hydroxybenzylidene)-3-(3-pyridyl)-2-thioxo-thiazolidin-4-one (5E)-5-[(4-hydroxyphenyl)methylidene]-3-pyridin-3-yl-2-sulfanylidene-1,3-thiazolidin-4-one MLS000701212 cid_6115882
Type:
Small organic molecule
Emp. Form.:
C15H10N2O2S2
Mol. Mass.:
314.382
SMILES:
Oc1ccc(\C=C2\SC(=S)N(C2=O)c2cccnc2)cc1
: