Target
Eukaryotic translation initiation factor 4 gamma 1
Ligand
BDBM39687
Substrate
Meas. Tech.
Dose Response Confirmation for Small Molecule Inhibitors of Eukaryotic Translation Initiation
IC50
33765.3093±n/a nM
Citation
 PubChem, PC Dose Response Confirmation for Small Molecule Inhibitors of Eukaryotic Translation Initiation PubChem Bioassay (2009)[AID] 
Target
Name:
Eukaryotic translation initiation factor 4 gamma 1
Synonyms:
EIF4F EIF4G1 IF4G1_HUMAN | eukaryotic translation initiation factor 4 gamma, 1 isoform 4
Type:
Enzyme Catalytic Domain
Mol. Mass.:
175455.17
Organism:
Homo sapiens (Human)
Description:
Q04637
Residue:
1599
  
Inhibitor
Name:
BDBM39687
Synonyms:
(2E)-1-ethyl-2-[(1-ethyl-2-quinolin-1-iumyl)methylidene]quinoline;chloride (2E)-1-ethyl-2-[(1-ethylquinolin-1-ium-2-yl)methylidene]quinoline;chloride CHEMBL1197556 SMR000137574 | cid_5717105
Type:
Small organic molecule
Emp. Form.:
C23H23N2
Mol. Mass.:
327.4416
SMILES:
CCN1\C(=C\c2ccc3ccccc3[n+]2CC)C=Cc2ccccc12
: