Target
D(1B) dopamine receptor
Ligand
BDBM48975
Substrate
Meas. Tech.
Allosteric Modulators of D1 Receptors: Dose-dependent Counterscreen
EC50
0.00374±n/a nM
Citation
 PubChem, PC Allosteric Modulators of D1 Receptors: Dose-dependent Counterscreen PubChem Bioassay (2007)[AID] 
Target
Name:
D(1B) dopamine receptor
Synonyms:
D(5) dopamine receptor DOPAMINE D5 DRD1L2 DRD5_HUMAN | dopamine receptor D5
Type:
Protein
Mol. Mass.:
52943.41
Organism:
Homo sapiens (Human)
Description:
P21918
Residue:
477
  
Inhibitor
Name:
BDBM48975
Synonyms:
2-(butylthio)-3-ethyl-6-methyl-6,7-dihydrothieno[3,2-d]pyrimidin-4-one MLS000101652 cid_4144446
Type:
Small organic molecule
Emp. Form.:
C13H20N2OS2
Mol. Mass.:
284.441
SMILES:
CCCCSc1nc2CC(C)Sc2c(=O)n1CC
: