Target
6-phosphofructo-2-kinase/fructose-2,6-bisphosphatase 4
Ligand
BDBM267042
Substrate
Meas. Tech.
PFKFB4 Assay
IC50
5800±n/a nM
Citation
 Martinsson, JFaernegardh, KJoensson, MRingom, R Bisarylsulfonamides useful in the treatment of inflammation and cancer US Patent  US9718809 Publication Date 8/1/2017 
Target
Name:
6-phosphofructo-2-kinase/fructose-2,6-bisphosphatase 4
Synonyms:
6-phosphofructo-2-kinase/fructose-2,6-bisphosphatase 4 (PFKFB4) PFKFB4
Type:
Enzyme
Mol. Mass.:
54039.68
Organism:
Homo sapiens (Human)
Description:
Q16877
Residue:
469
  
Inhibitor
Name:
BDBM267042
Synonyms:
Methyl 2-hydroxy-4-({[3-(trifluoromethoxy)phenyl]sulfonyl}amino)benzoate | US9718809, 44
Type:
Small organic molecule
Emp. Form.:
C15H12F3NO6S
Mol. Mass.:
391.319
SMILES:
COC(=O)c1ccc(NS(=O)(=O)c2cccc(OC(F)(F)F)c2)cc1O
: