Target
Transcription factor p65
Ligand
BDBM49255
Substrate
Meas. Tech.
Name: High Throughput Screen to Identify Compounds that increase expression of NF-kB in Human Neuronal Cells - Dose Response
EC50
125±n/a nM
Citation
 PubChem, PC Name: High Throughput Screen to Identify Compounds that increase expression of NF-kB in Human Neuronal Cells - Dose Response PubChem Bioassay (2008)[AID] 
Target
Name:
Transcription factor p65
Synonyms:
NFKB3 Nuclear factor NF-kappa-B p65 subunit TF65_HUMAN | v-rel reticuloendotheliosis viral oncogene homolog A isoform 1
Type:
Enzyme
Mol. Mass.:
60211.92
Organism:
Homo sapiens (Human)
Description:
Q04206
Residue:
551
  
Inhibitor
Name:
BDBM49255
Synonyms:
2-(4-fluorophenyl)-5H-[1,2,4]triazol[5,1-a]isoindole MLS000066641 cid_1236969
Type:
Small organic molecule
Emp. Form.:
C15H10FN3
Mol. Mass.:
251.2584
SMILES:
Fc1ccc(cc1)-c1nc2-c3ccccc3Cn2n1
: