Target
Transcription factor p65
Ligand
BDBM49636
Substrate
Meas. Tech.
Name: High Throughput Screen to Identify Compounds that increase expression of NF-kB in Human Neuronal Cells - Dose Response
EC50
356±n/a nM
Citation
 PubChem, PC Name: High Throughput Screen to Identify Compounds that increase expression of NF-kB in Human Neuronal Cells - Dose Response PubChem Bioassay (2008)[AID] 
Target
Name:
Transcription factor p65
Synonyms:
NFKB3 Nuclear factor NF-kappa-B p65 subunit TF65_HUMAN | v-rel reticuloendotheliosis viral oncogene homolog A isoform 1
Type:
Enzyme
Mol. Mass.:
60211.92
Organism:
Homo sapiens (Human)
Description:
Q04206
Residue:
551
  
Inhibitor
Name:
BDBM49636
Synonyms:
(E)-1-(2,3-dihydroindol-1-yl)-3-thiophen-2-yl-2-propen-1-one (E)-1-(2,3-dihydroindol-1-yl)-3-thiophen-2-ylprop-2-en-1-one 1-[3-(2-thienyl)acryloyl]indoline SMR000269910 | cid_885474
Type:
Small organic molecule
Emp. Form.:
C15H13NOS
Mol. Mass.:
255.335
SMILES:
O=C(\C=C\c1cccs1)N1CCc2ccccc12
: