Target
Glycoprotein 42
Ligand
BDBM51055
Substrate
Meas. Tech.
Dose Response Confirmation for Small Molecule Inhibitors of Epstein-Barr Virus
IC50
4950±n/a nM
Citation
 PubChem, PC Dose Response Confirmation for Small Molecule Inhibitors of Epstein-Barr Virus PubChem Bioassay (2008)[AID] 
Target
Name:
Glycoprotein 42
Synonyms:
BZLF2 | GP42_EBVA8
Type:
Enzyme Catalytic Domain
Mol. Mass.:
25424.12
Organism:
Human herpesvirus 4 type 2
Description:
gi_139424501
Residue:
223
  
Inhibitor
Name:
BDBM51055
Synonyms:
(E)-2-cyano-N-(2-methoxyphenyl)-3-(5-nitro-2-pyrrolidin-1-yl-phenyl)prop-2-enamide (E)-2-cyano-N-(2-methoxyphenyl)-3-(5-nitro-2-pyrrolidino-phenyl)acrylamide MLS000409077 cid_5917350
Type:
Small organic molecule
Emp. Form.:
C21H20N4O4
Mol. Mass.:
392.4079
SMILES:
COc1ccccc1NC(=O)C(=C\c1cc(ccc1N1CCCC1)[N+]([O-])=O)\C#N
: