Target
Glycoprotein 42
Ligand
BDBM51062
Substrate
Meas. Tech.
Dose Response Confirmation for Small Molecule Inhibitors of Epstein-Barr Virus
IC50
4220±n/a nM
Citation
 PubChem, PC Dose Response Confirmation for Small Molecule Inhibitors of Epstein-Barr Virus PubChem Bioassay (2008)[AID] 
Target
Name:
Glycoprotein 42
Synonyms:
BZLF2 | GP42_EBVA8
Type:
Enzyme Catalytic Domain
Mol. Mass.:
25424.12
Organism:
Human herpesvirus 4 type 2
Description:
gi_139424501
Residue:
223
  
Inhibitor
Name:
BDBM51062
Synonyms:
(4Z)-2-(4-methylphenyl)-4-[(3-methyl-1-phenyl-5-pyrrolidin-1-yl-pyrazol-4-yl)methylidene]-1,3-oxazol-5-one (4Z)-2-(4-methylphenyl)-4-[[3-methyl-1-phenyl-5-(1-pyrrolidinyl)-4-pyrazolyl]methylidene]-5-oxazolone MLS000391687 cid_2328158
Type:
Small organic molecule
Emp. Form.:
C25H24N4O2
Mol. Mass.:
412.4837
SMILES:
Cc1nn(c(N2CCCC2)c1\C=C1/N=C(OC1=O)c1ccc(C)cc1)-c1ccccc1
: