Target
Mucolipin-3
Ligand
BDBM46747
Substrate
Meas. Tech.
Fluorescence counterscreen assay for TRPN1 agonists: dose response cell-based high-throughput screening assay to identify agonists of the transient receptor potential channel ML3 (TRPML3)
EC50
29900±n/a nM
Citation
 PubChem, PC Fluorescence counterscreen assay for TRPN1 agonists: dose response cell-based high-throughput screening assay to identify agonists of the transient receptor potential channel ML3 (TRPML3) PubChem Bioassay (2009)[AID] 
Target
Name:
Mucolipin-3
Synonyms:
MCLN3_HUMAN MCOLN3 protein
Type:
Enzyme Catalytic Domain
Mol. Mass.:
64244.09
Organism:
Homo sapiens (Human)
Description:
Q8TDD5
Residue:
553
  
Inhibitor
Name:
BDBM46747
Synonyms:
1-(2-Fluoro-benzyl)-1H-[1,2,3]triazole-4-carboxylic acid [2-(4-ethyl-piperazin-1-yl)-ethyl]-amide N-[2-(4-ethyl-1-piperazinyl)ethyl]-1-[(2-fluorophenyl)methyl]-4-triazolecarboxamide N-[2-(4-ethylpiperazin-1-yl)ethyl]-1-[(2-fluorophenyl)methyl]triazole-4-carboxamide SMR000000666 | cid_649632
Type:
Small organic molecule
Emp. Form.:
C18H25FN6O
Mol. Mass.:
360.4291
SMILES:
CCN1CCN(CCNC(=O)c2cn(Cc3ccccc3F)nn2)CC1
: