Target
Mucolipin-3
Ligand
BDBM46749
Substrate
Meas. Tech.
Fluorescence counterscreen assay for TRPN1 agonists: dose response cell-based high-throughput screening assay to identify agonists of the transient receptor potential channel ML3 (TRPML3)
EC50
29900±n/a nM
Citation
 PubChem, PC Fluorescence counterscreen assay for TRPN1 agonists: dose response cell-based high-throughput screening assay to identify agonists of the transient receptor potential channel ML3 (TRPML3) PubChem Bioassay (2009)[AID] 
Target
Name:
Mucolipin-3
Synonyms:
MCLN3_HUMAN MCOLN3 protein
Type:
Enzyme Catalytic Domain
Mol. Mass.:
64244.09
Organism:
Homo sapiens (Human)
Description:
Q8TDD5
Residue:
553
  
Inhibitor
Name:
BDBM46749
Synonyms:
1-acetyl-3-(2,6-dimethyl-4-pyranylidene)-2-indolone 1-acetyl-3-(2,6-dimethylpyran-4-ylidene)indol-2-one 3-(2,6-dimethylpyran-4-ylidene)-1-ethanoyl-indol-2-one SMR000019908 | cid_697318
Type:
Small organic molecule
Emp. Form.:
C17H15NO3
Mol. Mass.:
281.3059
SMILES:
[#6]-[#6](=O)-[#7]-1-[#6](=O)\[#6](-c2ccccc-12)=[#6]-1\[#6]=[#6](-[#6])-[#8]-[#6](-[#6])=[#6]-1
: