Target
Mucolipin-3
Ligand
BDBM30910
Substrate
Meas. Tech.
Fluorescence counterscreen assay for TRPN1 agonists: dose response cell-based high-throughput screening assay to identify agonists of the transient receptor potential channel ML3 (TRPML3)
EC50
29900±n/a nM
Citation
 PubChem, PC Fluorescence counterscreen assay for TRPN1 agonists: dose response cell-based high-throughput screening assay to identify agonists of the transient receptor potential channel ML3 (TRPML3) PubChem Bioassay (2009)[AID] 
Target
Name:
Mucolipin-3
Synonyms:
MCLN3_HUMAN MCOLN3 protein
Type:
Enzyme Catalytic Domain
Mol. Mass.:
64244.09
Organism:
Homo sapiens (Human)
Description:
Q8TDD5
Residue:
553
  
Inhibitor
Name:
BDBM30910
Synonyms:
2-(4-ethoxy-N-(4-fluorophenyl)sulfonyl-anilino)acetic acid 2-[(4-ethoxyphenyl)-(4-fluorophenyl)sulfonyl-amino]ethanoic acid N-(4-ethoxyphenyl)-N-[(4-fluorophenyl)sulfonyl]glycine cid_1266057
Type:
Small organic molecule
Emp. Form.:
C16H16FNO5S
Mol. Mass.:
353.365
SMILES:
CCOc1ccc(cc1)N(CC(O)=O)S(=O)(=O)c1ccc(F)cc1
: