Target
Mucolipin-3
Ligand
BDBM46755
Substrate
Meas. Tech.
Fluorescence counterscreen assay for TRPN1 agonists: dose response cell-based high-throughput screening assay to identify agonists of the transient receptor potential channel ML3 (TRPML3)
EC50
29900±n/a nM
Citation
 PubChem, PC Fluorescence counterscreen assay for TRPN1 agonists: dose response cell-based high-throughput screening assay to identify agonists of the transient receptor potential channel ML3 (TRPML3) PubChem Bioassay (2009)[AID] 
Target
Name:
Mucolipin-3
Synonyms:
MCLN3_HUMAN MCOLN3 protein
Type:
Enzyme Catalytic Domain
Mol. Mass.:
64244.09
Organism:
Homo sapiens (Human)
Description:
Q8TDD5
Residue:
553
  
Inhibitor
Name:
BDBM46755
Synonyms:
2-[6-[(4-fluorophenyl)sulfamoyl]-2-keto-1,3-benzoxazol-3-yl]acetic acid ethyl ester MLS000118243 cid_5307185 ethyl 2-[6-[(4-fluorophenyl)sulfamoyl]-2-oxo-1,3-benzoxazol-3-yl]acetate
Type:
Small organic molecule
Emp. Form.:
C17H15FN2O6S
Mol. Mass.:
394.374
SMILES:
CCOC(=O)Cn1c2ccc(cc2oc1=O)S(=O)(=O)Nc1ccc(F)cc1
: