Target
Mucolipin-3
Ligand
BDBM46756
Substrate
Meas. Tech.
Fluorescence counterscreen assay for TRPN1 agonists: dose response cell-based high-throughput screening assay to identify agonists of the transient receptor potential channel ML3 (TRPML3)
EC50
4500±n/a nM
Citation
 PubChem, PC Fluorescence counterscreen assay for TRPN1 agonists: dose response cell-based high-throughput screening assay to identify agonists of the transient receptor potential channel ML3 (TRPML3) PubChem Bioassay (2009)[AID] 
Target
Name:
Mucolipin-3
Synonyms:
MCLN3_HUMAN MCOLN3 protein
Type:
Enzyme Catalytic Domain
Mol. Mass.:
64244.09
Organism:
Homo sapiens (Human)
Description:
Q8TDD5
Residue:
553
  
Inhibitor
Name:
BDBM46756
Synonyms:
MLS000103340 N-[5-(2-thienyl)-1,3,4-oxadiazol-2-yl]-3-(trifluoromethyl)benzamide cid_2104451
Type:
Small organic molecule
Emp. Form.:
C14H8F3N3O2S
Mol. Mass.:
339.292
SMILES:
FC(F)(F)c1cccc(c1)C(=O)Nc1nnc(o1)-c1cccs1
: