Target
Mucolipin-3
Ligand
BDBM46759
Substrate
Meas. Tech.
Fluorescence counterscreen assay for TRPN1 agonists: dose response cell-based high-throughput screening assay to identify agonists of the transient receptor potential channel ML3 (TRPML3)
EC50
29900±n/a nM
Citation
 PubChem, PC Fluorescence counterscreen assay for TRPN1 agonists: dose response cell-based high-throughput screening assay to identify agonists of the transient receptor potential channel ML3 (TRPML3) PubChem Bioassay (2009)[AID] 
Target
Name:
Mucolipin-3
Synonyms:
MCLN3_HUMAN MCOLN3 protein
Type:
Enzyme Catalytic Domain
Mol. Mass.:
64244.09
Organism:
Homo sapiens (Human)
Description:
Q8TDD5
Residue:
553
  
Inhibitor
Name:
BDBM46759
Synonyms:
2-[(3-chlorobenzoyl)amino]-3-(4-nitrobenzyl)oximino-propionic acid methyl ester MLS000539551 cid_3346356 methyl 2-[(3-chlorobenzoyl)amino]-3-{[(4-nitrobenzyl)oxy]imino}propanoate | methyl 2-[(3-chlorophenyl)carbonylamino]-3-[(4-nitrophenyl)methoxyimino]propanoate
Type:
Small organic molecule
Emp. Form.:
C18H16ClN3O6
Mol. Mass.:
405.789
SMILES:
COC(=O)C([CH+][N-]OCc1ccc(cc1)[N+]([O-])=O)NC(=O)c1cccc(Cl)c1
: