Target
Mucolipin-3
Ligand
BDBM46762
Substrate
Meas. Tech.
Fluorescence counterscreen assay for TRPN1 agonists: dose response cell-based high-throughput screening assay to identify agonists of the transient receptor potential channel ML3 (TRPML3)
EC50
29900±n/a nM
Citation
 PubChem, PC Fluorescence counterscreen assay for TRPN1 agonists: dose response cell-based high-throughput screening assay to identify agonists of the transient receptor potential channel ML3 (TRPML3) PubChem Bioassay (2009)[AID] 
Target
Name:
Mucolipin-3
Synonyms:
MCLN3_HUMAN MCOLN3 protein
Type:
Enzyme Catalytic Domain
Mol. Mass.:
64244.09
Organism:
Homo sapiens (Human)
Description:
Q8TDD5
Residue:
553
  
Inhibitor
Name:
BDBM46762
Synonyms:
2-[(2-{[(4-fluorophenyl)sulfonyl]amino}phenyl)sulfanyl]-N-[5-(trifluoromethyl)-1,3,4-thiadiazol-2-yl]acetamide 2-[2-[(4-fluorophenyl)sulfonylamino]phenyl]sulfanyl-N-[5-(trifluoromethyl)-1,3,4-thiadiazol-2-yl]ethanamide MLS000331322 cid_4310460
Type:
Small organic molecule
Emp. Form.:
C17H12F4N4O3S3
Mol. Mass.:
492.491
SMILES:
Fc1ccc(cc1)S(=O)(=O)Nc1ccccc1SCC(=O)Nc1nnc(s1)C(F)(F)F
: