Target
Mucolipin-3
Ligand
BDBM46763
Substrate
Meas. Tech.
Fluorescence counterscreen assay for TRPN1 agonists: dose response cell-based high-throughput screening assay to identify agonists of the transient receptor potential channel ML3 (TRPML3)
EC50
29900±n/a nM
Citation
 PubChem, PC Fluorescence counterscreen assay for TRPN1 agonists: dose response cell-based high-throughput screening assay to identify agonists of the transient receptor potential channel ML3 (TRPML3) PubChem Bioassay (2009)[AID] 
Target
Name:
Mucolipin-3
Synonyms:
MCLN3_HUMAN MCOLN3 protein
Type:
Enzyme Catalytic Domain
Mol. Mass.:
64244.09
Organism:
Homo sapiens (Human)
Description:
Q8TDD5
Residue:
553
  
Inhibitor
Name:
BDBM46763
Synonyms:
2-[(2-{[(4-methylphenyl)sulfonyl]amino}phenyl)sulfanyl]-N-[5-(trifluoromethyl)-1,3,4-thiadiazol-2-yl]acetamide 2-[2-[(4-methylphenyl)sulfonylamino]phenyl]sulfanyl-N-[5-(trifluoromethyl)-1,3,4-thiadiazol-2-yl]ethanamide 2-[[2-[(4-methylphenyl)sulfonylamino]phenyl]thio]-N-[5-(trifluoromethyl)-1,3,4-thiadiazol-2-yl]acetamide SMR000168735 | cid_5102346
Type:
Small organic molecule
Emp. Form.:
C18H15F3N4O3S3
Mol. Mass.:
488.527
SMILES:
Cc1ccc(cc1)S(=O)(=O)Nc1ccccc1SCC(=O)Nc1nnc(s1)C(F)(F)F
: