Target
Mucolipin-3
Ligand
BDBM46765
Substrate
Meas. Tech.
Fluorescence counterscreen assay for TRPN1 agonists: dose response cell-based high-throughput screening assay to identify agonists of the transient receptor potential channel ML3 (TRPML3)
EC50
29900±n/a nM
Citation
 PubChem, PC Fluorescence counterscreen assay for TRPN1 agonists: dose response cell-based high-throughput screening assay to identify agonists of the transient receptor potential channel ML3 (TRPML3) PubChem Bioassay (2009)[AID] 
Target
Name:
Mucolipin-3
Synonyms:
MCLN3_HUMAN MCOLN3 protein
Type:
Enzyme Catalytic Domain
Mol. Mass.:
64244.09
Organism:
Homo sapiens (Human)
Description:
Q8TDD5
Residue:
553
  
Inhibitor
Name:
BDBM46765
Synonyms:
4-[[2-(benzenesulfonamido)benzoyl]amino]benzoic acid methyl ester MLS000581884 cid_1289514 methyl 4-[[2-(benzenesulfonamido)benzoyl]amino]benzoate | methyl 4-[[2-(phenylsulfonylamino)phenyl]carbonylamino]benzoate
Type:
Small organic molecule
Emp. Form.:
C21H18N2O5S
Mol. Mass.:
410.443
SMILES:
COC(=O)c1ccc(NC(=O)c2ccccc2NS(=O)(=O)c2ccccc2)cc1
: