Target
Mucolipin-3
Ligand
BDBM46766
Substrate
Meas. Tech.
Fluorescence counterscreen assay for TRPN1 agonists: dose response cell-based high-throughput screening assay to identify agonists of the transient receptor potential channel ML3 (TRPML3)
EC50
29900±n/a nM
Citation
 PubChem, PC Fluorescence counterscreen assay for TRPN1 agonists: dose response cell-based high-throughput screening assay to identify agonists of the transient receptor potential channel ML3 (TRPML3) PubChem Bioassay (2009)[AID] 
Target
Name:
Mucolipin-3
Synonyms:
MCLN3_HUMAN MCOLN3 protein
Type:
Enzyme Catalytic Domain
Mol. Mass.:
64244.09
Organism:
Homo sapiens (Human)
Description:
Q8TDD5
Residue:
553
  
Inhibitor
Name:
BDBM46766
Synonyms:
3-[(3,4-dichlorophenyl)carbamoylamino]benzoic acid methyl ester MLS000581944 cid_734388 methyl 3-[(3,4-dichlorophenyl)carbamoylamino]benzoate
Type:
Small organic molecule
Emp. Form.:
C15H12Cl2N2O3
Mol. Mass.:
339.173
SMILES:
COC(=O)c1cccc(NC(=O)Nc2ccc(Cl)c(Cl)c2)c1
: