Target
Mucolipin-3
Ligand
BDBM46767
Substrate
Meas. Tech.
Fluorescence counterscreen assay for TRPN1 agonists: dose response cell-based high-throughput screening assay to identify agonists of the transient receptor potential channel ML3 (TRPML3)
EC50
2430±n/a nM
Citation
 PubChem, PC Fluorescence counterscreen assay for TRPN1 agonists: dose response cell-based high-throughput screening assay to identify agonists of the transient receptor potential channel ML3 (TRPML3) PubChem Bioassay (2009)[AID] 
Target
Name:
Mucolipin-3
Synonyms:
MCLN3_HUMAN MCOLN3 protein
Type:
Enzyme Catalytic Domain
Mol. Mass.:
64244.09
Organism:
Homo sapiens (Human)
Description:
Q8TDD5
Residue:
553
  
Inhibitor
Name:
BDBM46767
Synonyms:
(5Z)-3-ethyl-5-(4-pyrrolidinobenzylidene)-2-thioxo-4-imidazolidinone (5Z)-3-ethyl-5-[(4-pyrrolidin-1-ylphenyl)methylidene]-2-sulfanylideneimidazolidin-4-one 3-ethyl-5-[4-(1-pyrrolidinyl)benzylidene]-2-thioxo-4-imidazolidinone SMR000198376 | cid_5415878
Type:
Small organic molecule
Emp. Form.:
C16H19N3OS
Mol. Mass.:
301.407
SMILES:
CCN1C(=S)N\C(=C/c2ccc(cc2)N2CCCC2)C1=O
: