Target
Mucolipin-3
Ligand
BDBM46768
Substrate
Meas. Tech.
Fluorescence counterscreen assay for TRPN1 agonists: dose response cell-based high-throughput screening assay to identify agonists of the transient receptor potential channel ML3 (TRPML3)
EC50
9970±n/a nM
Citation
 PubChem, PC Fluorescence counterscreen assay for TRPN1 agonists: dose response cell-based high-throughput screening assay to identify agonists of the transient receptor potential channel ML3 (TRPML3) PubChem Bioassay (2009)[AID] 
Target
Name:
Mucolipin-3
Synonyms:
MCLN3_HUMAN MCOLN3 protein
Type:
Enzyme Catalytic Domain
Mol. Mass.:
64244.09
Organism:
Homo sapiens (Human)
Description:
Q8TDD5
Residue:
553
  
Inhibitor
Name:
BDBM46768
Synonyms:
6-(1-piperidinyl)-2-propyl-1H-benzo[de]isoquinoline-1,3(2H)-dione 6-piperidin-1-yl-2-propyl-benzo[de]isoquinoline-1,3-dione 6-piperidino-2-propyl-benzo[de]isoquinoline-1,3-quinone SMR000198218 | cid_2937970
Type:
Small organic molecule
Emp. Form.:
C20H22N2O2
Mol. Mass.:
322.4009
SMILES:
CCCN1C(=O)c2cccc3c(ccc(C1=O)c23)N1CCCCC1
: