Target
Mucolipin-3
Ligand
BDBM46769
Substrate
Meas. Tech.
Fluorescence counterscreen assay for TRPN1 agonists: dose response cell-based high-throughput screening assay to identify agonists of the transient receptor potential channel ML3 (TRPML3)
EC50
29900±n/a nM
Citation
 PubChem, PC Fluorescence counterscreen assay for TRPN1 agonists: dose response cell-based high-throughput screening assay to identify agonists of the transient receptor potential channel ML3 (TRPML3) PubChem Bioassay (2009)[AID] 
Target
Name:
Mucolipin-3
Synonyms:
MCLN3_HUMAN MCOLN3 protein
Type:
Enzyme Catalytic Domain
Mol. Mass.:
64244.09
Organism:
Homo sapiens (Human)
Description:
Q8TDD5
Residue:
553
  
Inhibitor
Name:
BDBM46769
Synonyms:
4-(4-Nitro-phenoxy)-N-phenyl-benzenesulfonamide 4-(4-nitrophenoxy)-N-phenylbenzenesulfonamide SMR000171205 | cid_1116087
Type:
Small organic molecule
Emp. Form.:
C18H14N2O5S
Mol. Mass.:
370.379
SMILES:
[O-][N+](=O)c1ccc(Oc2ccc(cc2)S(=O)(=O)Nc2ccccc2)cc1
: