Target
Mucolipin-3
Ligand
BDBM46770
Substrate
Meas. Tech.
Fluorescence counterscreen assay for TRPN1 agonists: dose response cell-based high-throughput screening assay to identify agonists of the transient receptor potential channel ML3 (TRPML3)
EC50
1900±n/a nM
Citation
 PubChem, PC Fluorescence counterscreen assay for TRPN1 agonists: dose response cell-based high-throughput screening assay to identify agonists of the transient receptor potential channel ML3 (TRPML3) PubChem Bioassay (2009)[AID] 
Target
Name:
Mucolipin-3
Synonyms:
MCLN3_HUMAN MCOLN3 protein
Type:
Enzyme Catalytic Domain
Mol. Mass.:
64244.09
Organism:
Homo sapiens (Human)
Description:
Q8TDD5
Residue:
553
  
Inhibitor
Name:
BDBM46770
Synonyms:
(2E,5E)-2-[4-(dimethylamino)benzylidene]-5-(2-methylpropylidene)cyclopentanone (2E,5E)-2-[[4-(dimethylamino)phenyl]methylidene]-5-(2-methylpropylidene)cyclopentan-1-one SMR000204795 | cid_12004767
Type:
Small organic molecule
Emp. Form.:
C18H23NO
Mol. Mass.:
269.3813
SMILES:
CC(C)C=C1CCC(=Cc2ccc(cc2)N(C)C)C1=O
: