Target
Mucolipin-3
Ligand
BDBM42058
Substrate
Meas. Tech.
Fluorescence counterscreen assay for TRPN1 agonists: dose response cell-based high-throughput screening assay to identify agonists of the transient receptor potential channel ML3 (TRPML3)
EC50
29900±n/a nM
Citation
 PubChem, PC Fluorescence counterscreen assay for TRPN1 agonists: dose response cell-based high-throughput screening assay to identify agonists of the transient receptor potential channel ML3 (TRPML3) PubChem Bioassay (2009)[AID] 
Target
Name:
Mucolipin-3
Synonyms:
MCLN3_HUMAN MCOLN3 protein
Type:
Enzyme Catalytic Domain
Mol. Mass.:
64244.09
Organism:
Homo sapiens (Human)
Description:
Q8TDD5
Residue:
553
  
Inhibitor
Name:
BDBM42058
Synonyms:
(2-Cyclohex-1-enyl-ethyl)-(5H-pyrimido[5,4-b]indol-4-yl)-amine MLS000580267 N-[2-(cyclohexen-1-yl)ethyl]-5H-pyrimido[5,4-b]indol-4-amine cid_944164
Type:
Small organic molecule
Emp. Form.:
C18H20N4
Mol. Mass.:
292.3782
SMILES:
C(CC1=CCCCC1)Nc1ncnc2c3ccccc3[nH]c12
: