Target
Mucolipin-3
Ligand
BDBM46774
Substrate
Meas. Tech.
Fluorescence counterscreen assay for TRPN1 agonists: dose response cell-based high-throughput screening assay to identify agonists of the transient receptor potential channel ML3 (TRPML3)
EC50
292±n/a nM
Citation
 PubChem, PC Fluorescence counterscreen assay for TRPN1 agonists: dose response cell-based high-throughput screening assay to identify agonists of the transient receptor potential channel ML3 (TRPML3) PubChem Bioassay (2009)[AID] 
Target
Name:
Mucolipin-3
Synonyms:
MCLN3_HUMAN MCOLN3 protein
Type:
Enzyme Catalytic Domain
Mol. Mass.:
64244.09
Organism:
Homo sapiens (Human)
Description:
Q8TDD5
Residue:
553
  
Inhibitor
Name:
BDBM46774
Synonyms:
4-tert-butyl-N-[(2-thenoylamino)thiocarbamoyl]benzamide 4-tert-butyl-N-[(thiophene-2-carbonylamino)carbamothioyl]benzamide 4-tert-butyl-N-{[2-(thien-2-ylcarbonyl)hydrazino]carbothioyl}benzamide SMR000228773 | cid_1790491
Type:
Small organic molecule
Emp. Form.:
C17H19N3O2S2
Mol. Mass.:
361.482
SMILES:
CC(C)(C)c1ccc(cc1)C(=O)NC(=S)NNC(=O)c1cccs1
: