Target
Mucolipin-3
Ligand
BDBM46776
Substrate
Meas. Tech.
Fluorescence counterscreen assay for TRPN1 agonists: dose response cell-based high-throughput screening assay to identify agonists of the transient receptor potential channel ML3 (TRPML3)
EC50
24300±n/a nM
Citation
 PubChem, PC Fluorescence counterscreen assay for TRPN1 agonists: dose response cell-based high-throughput screening assay to identify agonists of the transient receptor potential channel ML3 (TRPML3) PubChem Bioassay (2009)[AID] 
Target
Name:
Mucolipin-3
Synonyms:
MCLN3_HUMAN MCOLN3 protein
Type:
Enzyme Catalytic Domain
Mol. Mass.:
64244.09
Organism:
Homo sapiens (Human)
Description:
Q8TDD5
Residue:
553
  
Inhibitor
Name:
BDBM46776
Synonyms:
2-[(5-chloranylthiophen-2-yl)sulfonylamino]-N-[2-(phenylmethyl)phenyl]benzamide MLS000401581 N-(2-benzylphenyl)-2-[(5-chlorothiophen-2-yl)sulfonylamino]benzamide cid_3677740
Type:
Small organic molecule
Emp. Form.:
C24H19ClN2O3S2
Mol. Mass.:
483.002
SMILES:
Clc1ccc(s1)S(=O)(=O)Nc1ccccc1C(=O)Nc1ccccc1Cc1ccccc1
: