Target
Mucolipin-3
Ligand
BDBM46777
Substrate
Meas. Tech.
Fluorescence counterscreen assay for TRPN1 agonists: dose response cell-based high-throughput screening assay to identify agonists of the transient receptor potential channel ML3 (TRPML3)
EC50
29900±n/a nM
Citation
 PubChem, PC Fluorescence counterscreen assay for TRPN1 agonists: dose response cell-based high-throughput screening assay to identify agonists of the transient receptor potential channel ML3 (TRPML3) PubChem Bioassay (2009)[AID] 
Target
Name:
Mucolipin-3
Synonyms:
MCLN3_HUMAN MCOLN3 protein
Type:
Enzyme Catalytic Domain
Mol. Mass.:
64244.09
Organism:
Homo sapiens (Human)
Description:
Q8TDD5
Residue:
553
  
Inhibitor
Name:
BDBM46777
Synonyms:
MLS000393914 N-tert-butyl-2-[(2-methoxyphenyl)-thiophen-2-ylsulfonyl-amino]ethanamide SMR000247309 | cid_2437957
Type:
Small organic molecule
Emp. Form.:
C17H22N2O4S2
Mol. Mass.:
382.498
SMILES:
COc1ccccc1N(CC(=O)NC(C)(C)C)S(=O)(=O)c1cccs1
: