Target
Mucolipin-3
Ligand
BDBM46779
Substrate
Meas. Tech.
Fluorescence counterscreen assay for TRPN1 agonists: dose response cell-based high-throughput screening assay to identify agonists of the transient receptor potential channel ML3 (TRPML3)
EC50
29900±n/a nM
Citation
 PubChem, PC Fluorescence counterscreen assay for TRPN1 agonists: dose response cell-based high-throughput screening assay to identify agonists of the transient receptor potential channel ML3 (TRPML3) PubChem Bioassay (2009)[AID] 
Target
Name:
Mucolipin-3
Synonyms:
MCLN3_HUMAN MCOLN3 protein
Type:
Enzyme Catalytic Domain
Mol. Mass.:
64244.09
Organism:
Homo sapiens (Human)
Description:
Q8TDD5
Residue:
553
  
Inhibitor
Name:
BDBM46779
Synonyms:
1-butyl-3-(4-nitrophenyl)thiourea N-butyl-N'-(4-nitrophenyl)thiourea cid_2897386
Type:
Small organic molecule
Emp. Form.:
C11H15N3O2S
Mol. Mass.:
253.321
SMILES:
CCCCNC(=S)Nc1ccc(cc1)[N+]([O-])=O
: