Target
Mucolipin-3
Ligand
BDBM46780
Substrate
Meas. Tech.
Fluorescence counterscreen assay for TRPN1 agonists: dose response cell-based high-throughput screening assay to identify agonists of the transient receptor potential channel ML3 (TRPML3)
EC50
29900±n/a nM
Citation
 PubChem, PC Fluorescence counterscreen assay for TRPN1 agonists: dose response cell-based high-throughput screening assay to identify agonists of the transient receptor potential channel ML3 (TRPML3) PubChem Bioassay (2009)[AID] 
Target
Name:
Mucolipin-3
Synonyms:
MCLN3_HUMAN MCOLN3 protein
Type:
Enzyme Catalytic Domain
Mol. Mass.:
64244.09
Organism:
Homo sapiens (Human)
Description:
Q8TDD5
Residue:
553
  
Inhibitor
Name:
BDBM46780
Synonyms:
1-(4-fluoranyl-3-nitro-phenyl)-3-phenyl-urea 1-(4-fluoro-3-nitrophenyl)-3-phenylurea N-(4-fluoro-3-nitrophenyl)-N'-phenylurea cid_844760
Type:
Small organic molecule
Emp. Form.:
C13H10FN3O3
Mol. Mass.:
275.2352
SMILES:
[O-][N+](=O)c1cc(NC(=O)Nc2ccccc2)ccc1F
: