Target
Mucolipin-3
Ligand
BDBM46782
Substrate
Meas. Tech.
Fluorescence counterscreen assay for TRPN1 agonists: dose response cell-based high-throughput screening assay to identify agonists of the transient receptor potential channel ML3 (TRPML3)
EC50
29900±n/a nM
Citation
 PubChem, PC Fluorescence counterscreen assay for TRPN1 agonists: dose response cell-based high-throughput screening assay to identify agonists of the transient receptor potential channel ML3 (TRPML3) PubChem Bioassay (2009)[AID] 
Target
Name:
Mucolipin-3
Synonyms:
MCLN3_HUMAN MCOLN3 protein
Type:
Enzyme Catalytic Domain
Mol. Mass.:
64244.09
Organism:
Homo sapiens (Human)
Description:
Q8TDD5
Residue:
553
  
Inhibitor
Name:
BDBM46782
Synonyms:
1-(4-methylphenyl)-3-(5-pyridin-4-yl-1,3,4-thiadiazol-2-yl)urea MLS000764813 cid_881003
Type:
Small organic molecule
Emp. Form.:
C15H13N5OS
Mol. Mass.:
311.362
SMILES:
Cc1ccc(NC(=O)Nc2nnc(s2)-c2ccncc2)cc1
: