Target
Mucolipin-3
Ligand
BDBM46783
Substrate
Meas. Tech.
Fluorescence counterscreen assay for TRPN1 agonists: dose response cell-based high-throughput screening assay to identify agonists of the transient receptor potential channel ML3 (TRPML3)
EC50
29900±n/a nM
Citation
 PubChem, PC Fluorescence counterscreen assay for TRPN1 agonists: dose response cell-based high-throughput screening assay to identify agonists of the transient receptor potential channel ML3 (TRPML3) PubChem Bioassay (2009)[AID] 
Target
Name:
Mucolipin-3
Synonyms:
MCLN3_HUMAN MCOLN3 protein
Type:
Enzyme Catalytic Domain
Mol. Mass.:
64244.09
Organism:
Homo sapiens (Human)
Description:
Q8TDD5
Residue:
553
  
Inhibitor
Name:
BDBM46783
Synonyms:
4-(4-morpholinylmethyl)-N-[4-(phenylsulfamoyl)phenyl]benzamide 4-(morpholinomethyl)-N-[4-(phenylsulfamoyl)phenyl]benzamide SMR000274529 | cid_3147868
Type:
Small organic molecule
Emp. Form.:
C24H25N3O4S
Mol. Mass.:
451.538
SMILES:
O=C(Nc1ccc(cc1)S(=O)(=O)Nc1ccccc1)c1ccc(CN2CCOCC2)cc1
: