Target
Mucolipin-3
Ligand
BDBM46784
Substrate
Meas. Tech.
Fluorescence counterscreen assay for TRPN1 agonists: dose response cell-based high-throughput screening assay to identify agonists of the transient receptor potential channel ML3 (TRPML3)
EC50
29900±n/a nM
Citation
 PubChem, PC Fluorescence counterscreen assay for TRPN1 agonists: dose response cell-based high-throughput screening assay to identify agonists of the transient receptor potential channel ML3 (TRPML3) PubChem Bioassay (2009)[AID] 
Target
Name:
Mucolipin-3
Synonyms:
MCLN3_HUMAN MCOLN3 protein
Type:
Enzyme Catalytic Domain
Mol. Mass.:
64244.09
Organism:
Homo sapiens (Human)
Description:
Q8TDD5
Residue:
553
  
Inhibitor
Name:
BDBM46784
Synonyms:
2,3,4,5,6-pentafluoro-N-(4-{[(4-methylphenyl)sulfonyl]amino}phenyl)benzamide 2,3,4,5,6-pentafluoro-N-[4-[(4-methylphenyl)sulfonylamino]phenyl]benzamide MLS000627018 cid_2181065
Type:
Small organic molecule
Emp. Form.:
C20H13F5N2O3S
Mol. Mass.:
456.386
SMILES:
Cc1ccc(cc1)S(=O)(=O)Nc1ccc(NC(=O)c2c(F)c(F)c(F)c(F)c2F)cc1
: