Target
Mucolipin-3
Ligand
BDBM43135
Substrate
Meas. Tech.
Fluorescence counterscreen assay for TRPN1 agonists: dose response cell-based high-throughput screening assay to identify agonists of the transient receptor potential channel ML3 (TRPML3)
EC50
7930±n/a nM
Citation
 PubChem, PC Fluorescence counterscreen assay for TRPN1 agonists: dose response cell-based high-throughput screening assay to identify agonists of the transient receptor potential channel ML3 (TRPML3) PubChem Bioassay (2009)[AID] 
Target
Name:
Mucolipin-3
Synonyms:
MCLN3_HUMAN MCOLN3 protein
Type:
Enzyme Catalytic Domain
Mol. Mass.:
64244.09
Organism:
Homo sapiens (Human)
Description:
Q8TDD5
Residue:
553
  
Inhibitor
Name:
BDBM43135
Synonyms:
2-[(5Z)-4-keto-5-[(2Z)-2-(3-methylthiazolidin-2-ylidene)ethylidene]-2-thioxo-thiazolidin-3-yl]acetic acid 2-[(5Z)-5-[(2Z)-2-(3-methyl-1,3-thiazolidin-2-ylidene)ethylidene]-4-oxo-2-sulfanylidene-1,3-thiazolidin-3-yl]acetic acid MLS000703412 cid_1734123
Type:
Small organic molecule
Emp. Form.:
C11H12N2O3S3
Mol. Mass.:
316.42
SMILES:
CN1CCS\C1=C/C=C1\SC(=S)N(CC(O)=O)C1=O
: