Target
Mucolipin-3
Ligand
BDBM46786
Substrate
Meas. Tech.
Fluorescence counterscreen assay for TRPN1 agonists: dose response cell-based high-throughput screening assay to identify agonists of the transient receptor potential channel ML3 (TRPML3)
EC50
1110±n/a nM
Citation
 PubChem, PC Fluorescence counterscreen assay for TRPN1 agonists: dose response cell-based high-throughput screening assay to identify agonists of the transient receptor potential channel ML3 (TRPML3) PubChem Bioassay (2009)[AID] 
Target
Name:
Mucolipin-3
Synonyms:
MCLN3_HUMAN MCOLN3 protein
Type:
Enzyme Catalytic Domain
Mol. Mass.:
64244.09
Organism:
Homo sapiens (Human)
Description:
Q8TDD5
Residue:
553
  
Inhibitor
Name:
BDBM46786
Synonyms:
(E)-2-(1,3-benzothiazol-2-yl)-3-(2-pyridinyl)-2-propenenitrile (E)-2-(1,3-benzothiazol-2-yl)-3-pyridin-2-yl-prop-2-enenitrile MLS000678060 cid_5730061
Type:
Small organic molecule
Emp. Form.:
C15H9N3S
Mol. Mass.:
263.317
SMILES:
N#C\C(=C/c1ccccn1)c1nc2ccccc2s1
: