Target
Mucolipin-3
Ligand
BDBM46788
Substrate
Meas. Tech.
Fluorescence counterscreen assay for TRPN1 agonists: dose response cell-based high-throughput screening assay to identify agonists of the transient receptor potential channel ML3 (TRPML3)
EC50
29900±n/a nM
Citation
 PubChem, PC Fluorescence counterscreen assay for TRPN1 agonists: dose response cell-based high-throughput screening assay to identify agonists of the transient receptor potential channel ML3 (TRPML3) PubChem Bioassay (2009)[AID] 
Target
Name:
Mucolipin-3
Synonyms:
MCLN3_HUMAN MCOLN3 protein
Type:
Enzyme Catalytic Domain
Mol. Mass.:
64244.09
Organism:
Homo sapiens (Human)
Description:
Q8TDD5
Residue:
553
  
Inhibitor
Name:
BDBM46788
Synonyms:
4-[(3-fluorophenyl)carbamoylamino]benzoic acid methyl ester MLS000679439 cid_6466215 methyl 4-[(3-fluorophenyl)carbamoylamino]benzoate
Type:
Small organic molecule
Emp. Form.:
C15H13FN2O3
Mol. Mass.:
288.2737
SMILES:
COC(=O)c1ccc(NC(=O)Nc2cccc(F)c2)cc1
: