Target
Mucolipin-3
Ligand
BDBM46789
Substrate
Meas. Tech.
Fluorescence counterscreen assay for TRPN1 agonists: dose response cell-based high-throughput screening assay to identify agonists of the transient receptor potential channel ML3 (TRPML3)
EC50
29900±n/a nM
Citation
 PubChem, PC Fluorescence counterscreen assay for TRPN1 agonists: dose response cell-based high-throughput screening assay to identify agonists of the transient receptor potential channel ML3 (TRPML3) PubChem Bioassay (2009)[AID] 
Target
Name:
Mucolipin-3
Synonyms:
MCLN3_HUMAN MCOLN3 protein
Type:
Enzyme Catalytic Domain
Mol. Mass.:
64244.09
Organism:
Homo sapiens (Human)
Description:
Q8TDD5
Residue:
553
  
Inhibitor
Name:
BDBM46789
Synonyms:
2-(2-methoxyphenyl)-N-(4-nitro-2-oxidanyl-phenyl)ethanamide N-(2-hydroxy-4-nitro-phenyl)-2-(2-methoxyphenyl)acetamide SMR000300963 | cid_4982397
Type:
Small organic molecule
Emp. Form.:
C15H14N2O5
Mol. Mass.:
302.2821
SMILES:
COc1ccccc1CC(=O)Nc1ccc(cc1O)[N+]([O-])=O
: