Target
Mitogen-activated protein kinase kinase kinase kinase 2
Ligand
BDBM40571
Substrate
Meas. Tech.
Dose Response Confirmation Screen via Multiplex HTS Assay for Inhibitors of MEK Kinase PB1 Domains, specifically MEK5 binding to MEK Kinase 2 Mutant
EC50
3400±n/a nM
Citation
 PubChem, PC Dose Response Confirmation Screen via Multiplex HTS Assay for Inhibitors of MEK Kinase PB1 Domains, specifically MEK5 binding to MEK Kinase 2 Mutant PubChem Bioassay (2009)[AID] 
Target
Name:
Mitogen-activated protein kinase kinase kinase kinase 2
Synonyms:
2.7.11.1 GC kinase Germinal center kinase MAP4K2 MEK kinase kinase 2 RAB8IP | Rab8-interacting protein
Type:
Mol. Mass.:
91551.35
Organism:
Homo sapiens (Human)
Description:
Residue:
820
  
Inhibitor
Name:
BDBM40571
Synonyms:
3-amino-6-methyl-7-thiazolo[3,2-b][1,2,4]triazinone 3-amino-6-methyl-thiazolo[3,2-b][1,2,4]triazin-7-one MLS000032547 cid_648831
Type:
Small organic molecule
Emp. Form.:
C6H6N4OS
Mol. Mass.:
182.203
SMILES:
Cc1nn2c(N)csc2nc1=O
: