Target
Mitogen-activated protein kinase kinase kinase kinase 2
Ligand
BDBM51792
Substrate
Meas. Tech.
Dose Response Confirmation Screen via Multiplex HTS Assay for Inhibitors of MEK Kinase PB1 Domains, specifically MEK5 binding to MEK Kinase 2 Mutant
EC50
30000±n/a nM
Citation
 PubChem, PC Dose Response Confirmation Screen via Multiplex HTS Assay for Inhibitors of MEK Kinase PB1 Domains, specifically MEK5 binding to MEK Kinase 2 Mutant PubChem Bioassay (2009)[AID] 
Target
Name:
Mitogen-activated protein kinase kinase kinase kinase 2
Synonyms:
2.7.11.1 GC kinase Germinal center kinase MAP4K2 MEK kinase kinase 2 RAB8IP | Rab8-interacting protein
Type:
Mol. Mass.:
91551.35
Organism:
Homo sapiens (Human)
Description:
Residue:
820
  
Inhibitor
Name:
BDBM51792
Synonyms:
MLS000072836 N'-cyclopentyl-N'-[2-(cyclopentylamino)-2-oxidanylidene-ethyl]-N-pyridin-2-yl-pentanediamide N'-cyclopentyl-N'-[2-(cyclopentylamino)-2-oxoethyl]-N-pyridin-2-ylpentanediamide SMR000004293 | cid_650348
Type:
Small organic molecule
Emp. Form.:
C22H32N4O3
Mol. Mass.:
400.5145
SMILES:
O=C(CCCC(=O)N(CC(=O)NC1CCCC1)C1CCCC1)Nc1ccccn1
: