Target
Mitogen-activated protein kinase kinase kinase kinase 2
Ligand
BDBM44448
Substrate
Meas. Tech.
Dose Response Confirmation Screen via Multiplex HTS Assay for Inhibitors of MEK Kinase PB1 Domains, specifically MEK5 binding to MEK Kinase 2 Mutant
EC50
30000±n/a nM
Citation
 PubChem, PC Dose Response Confirmation Screen via Multiplex HTS Assay for Inhibitors of MEK Kinase PB1 Domains, specifically MEK5 binding to MEK Kinase 2 Mutant PubChem Bioassay (2009)[AID] 
Target
Name:
Mitogen-activated protein kinase kinase kinase kinase 2
Synonyms:
2.7.11.1 GC kinase Germinal center kinase MAP4K2 MEK kinase kinase 2 RAB8IP | Rab8-interacting protein
Type:
Mol. Mass.:
91551.35
Organism:
Homo sapiens (Human)
Description:
Residue:
820
  
Inhibitor
Name:
BDBM44448
Synonyms:
MLS000091077 N-[2-(2-methyl-1H-indol-1-yl)ethyl]benzamide SMR000025640 | cid_3241951
Type:
Small organic molecule
Emp. Form.:
C18H18N2O
Mol. Mass.:
278.3483
SMILES:
Cc1cc2ccccc2n1CCNC(=O)c1ccccc1
: