Target
Mitogen-activated protein kinase kinase kinase kinase 2
Ligand
BDBM51795
Substrate
Meas. Tech.
Dose Response Confirmation Screen via Multiplex HTS Assay for Inhibitors of MEK Kinase PB1 Domains, specifically MEK5 binding to MEK Kinase 2 Mutant
EC50
30000±n/a nM
Citation
 PubChem, PC Dose Response Confirmation Screen via Multiplex HTS Assay for Inhibitors of MEK Kinase PB1 Domains, specifically MEK5 binding to MEK Kinase 2 Mutant PubChem Bioassay (2009)[AID] 
Target
Name:
Mitogen-activated protein kinase kinase kinase kinase 2
Synonyms:
2.7.11.1 GC kinase Germinal center kinase MAP4K2 MEK kinase kinase 2 RAB8IP | Rab8-interacting protein
Type:
Mol. Mass.:
91551.35
Organism:
Homo sapiens (Human)
Description:
Residue:
820
  
Inhibitor
Name:
BDBM51795
Synonyms:
1-(5-chloranylthiophen-2-yl)sulfonyl-4-(2-methoxyphenyl)piperazine 1-[(5-chloro-2-thienyl)sulfonyl]-4-(2-methoxyphenyl)piperazine MLS000062884 cid_1091576
Type:
Small organic molecule
Emp. Form.:
C15H17ClN2O3S2
Mol. Mass.:
372.89
SMILES:
COc1ccccc1N1CCN(CC1)S(=O)(=O)c1ccc(Cl)s1
: