Target
Mitogen-activated protein kinase kinase kinase kinase 2
Ligand
BDBM47934
Substrate
Meas. Tech.
Dose Response Confirmation Screen via Multiplex HTS Assay for Inhibitors of MEK Kinase PB1 Domains, specifically MEK5 binding to MEK Kinase 2 Mutant
EC50
30000±n/a nM
Citation
 PubChem, PC Dose Response Confirmation Screen via Multiplex HTS Assay for Inhibitors of MEK Kinase PB1 Domains, specifically MEK5 binding to MEK Kinase 2 Mutant PubChem Bioassay (2009)[AID] 
Target
Name:
Mitogen-activated protein kinase kinase kinase kinase 2
Synonyms:
2.7.11.1 GC kinase Germinal center kinase MAP4K2 MEK kinase kinase 2 RAB8IP | Rab8-interacting protein
Type:
Mol. Mass.:
91551.35
Organism:
Homo sapiens (Human)
Description:
Residue:
820
  
Inhibitor
Name:
BDBM47934
Synonyms:
MLS000101692 N-[2-(2-methylindol-1-yl)ethyl]thiophene-2-carboxamide cid_4349596
Type:
Small organic molecule
Emp. Form.:
C16H16N2OS
Mol. Mass.:
284.376
SMILES:
Cc1cc2ccccc2n1CCNC(=O)c1cccs1
: