Target
Mitogen-activated protein kinase kinase kinase kinase 2
Ligand
BDBM51796
Substrate
Meas. Tech.
Dose Response Confirmation Screen via Multiplex HTS Assay for Inhibitors of MEK Kinase PB1 Domains, specifically MEK5 binding to MEK Kinase 2 Mutant
EC50
3350±n/a nM
Citation
 PubChem, PC Dose Response Confirmation Screen via Multiplex HTS Assay for Inhibitors of MEK Kinase PB1 Domains, specifically MEK5 binding to MEK Kinase 2 Mutant PubChem Bioassay (2009)[AID] 
Target
Name:
Mitogen-activated protein kinase kinase kinase kinase 2
Synonyms:
2.7.11.1 GC kinase Germinal center kinase MAP4K2 MEK kinase kinase 2 RAB8IP | Rab8-interacting protein
Type:
Mol. Mass.:
91551.35
Organism:
Homo sapiens (Human)
Description:
Residue:
820
  
Inhibitor
Name:
BDBM51796
Synonyms:
(5Z)-5-[(2Z)-2-(3-ethyl-4,5-diphenyl-1,3-thiazol-2-ylidene)ethylidene]-3-methyl-2-sulfanylidene-1,3-thiazolidin-4-one (5Z)-5-[(2Z)-2-(3-ethyl-4,5-diphenyl-4-thiazolin-2-ylidene)ethylidene]-3-methyl-2-thioxo-thiazolidin-4-one MLS000526292 cid_1588251
Type:
Small organic molecule
Emp. Form.:
C23H20N2OS3
Mol. Mass.:
436.613
SMILES:
CCN1\C(SC(=C1c1ccccc1)c1ccccc1)=C\C=C1/SC(=S)N(C)C1=O
: