Target
Mitogen-activated protein kinase kinase kinase kinase 2
Ligand
BDBM43211
Substrate
Meas. Tech.
Dose Response Confirmation Screen via Multiplex HTS Assay for Inhibitors of MEK Kinase PB1 Domains, specifically MEK5 binding to MEK Kinase 2 Mutant
EC50
30000±n/a nM
Citation
 PubChem, PC Dose Response Confirmation Screen via Multiplex HTS Assay for Inhibitors of MEK Kinase PB1 Domains, specifically MEK5 binding to MEK Kinase 2 Mutant PubChem Bioassay (2009)[AID] 
Target
Name:
Mitogen-activated protein kinase kinase kinase kinase 2
Synonyms:
2.7.11.1 GC kinase Germinal center kinase MAP4K2 MEK kinase kinase 2 RAB8IP | Rab8-interacting protein
Type:
Mol. Mass.:
91551.35
Organism:
Homo sapiens (Human)
Description:
Residue:
820
  
Inhibitor
Name:
BDBM43211
Synonyms:
6-(4-Methoxy-phenyl)-2-piperazin-1-yl-pyrimidine-4-carbonitrile 6-(4-methoxyphenyl)-2-piperazin-1-yl-pyrimidine-4-carbonitrile 6-(4-methoxyphenyl)-2-piperazino-pyrimidine-4-carbonitrile SMR000148351 | cid_943399
Type:
Small organic molecule
Emp. Form.:
C16H17N5O
Mol. Mass.:
295.3391
SMILES:
COc1ccc(cc1)-c1cc(nc(n1)N1CCNCC1)C#N
: