Target
Mitogen-activated protein kinase kinase kinase kinase 2
Ligand
BDBM44965
Substrate
Meas. Tech.
Dose Response Confirmation Screen via Multiplex HTS Assay for Inhibitors of MEK Kinase PB1 Domains, specifically MEK5 binding to MEK Kinase 2 Mutant
EC50
10300±n/a nM
Citation
 PubChem, PC Dose Response Confirmation Screen via Multiplex HTS Assay for Inhibitors of MEK Kinase PB1 Domains, specifically MEK5 binding to MEK Kinase 2 Mutant PubChem Bioassay (2009)[AID] 
Target
Name:
Mitogen-activated protein kinase kinase kinase kinase 2
Synonyms:
2.7.11.1 GC kinase Germinal center kinase MAP4K2 MEK kinase kinase 2 RAB8IP | Rab8-interacting protein
Type:
Mol. Mass.:
91551.35
Organism:
Homo sapiens (Human)
Description:
Residue:
820
  
Inhibitor
Name:
BDBM44965
Synonyms:
5-acetoxy-2-[(amidinothio)methyl]-6-bromo-1-(p-tolyl)indole-3-carboxylic acid ethyl ester;hydrobromide MLS000545873 cid_11948870 ethyl 5-acetyloxy-6-bromanyl-2-(carbamimidoylsulfanylmethyl)-1-(4-methylphenyl)indole-3-carboxylate;hydrobromide | ethyl 5-acetyloxy-6-bromo-2-(carbamimidoylsulfanylmethyl)-1-(4-methylphenyl)indole-3-carboxylate;hydrobromide
Type:
Small organic molecule
Emp. Form.:
C22H22BrN3O4S
Mol. Mass.:
504.397
SMILES:
CCOC(=O)c1c(CSC(N)=N)n(-c2ccc(C)cc2)c2cc(Br)c(OC(C)=O)cc12
: