Target
Mitogen-activated protein kinase kinase kinase kinase 2
Ligand
BDBM51804
Substrate
Meas. Tech.
Dose Response Confirmation Screen via Multiplex HTS Assay for Inhibitors of MEK Kinase PB1 Domains, specifically MEK5 binding to MEK Kinase 2 Mutant
EC50
30000±n/a nM
Citation
 PubChem, PC Dose Response Confirmation Screen via Multiplex HTS Assay for Inhibitors of MEK Kinase PB1 Domains, specifically MEK5 binding to MEK Kinase 2 Mutant PubChem Bioassay (2009)[AID] 
Target
Name:
Mitogen-activated protein kinase kinase kinase kinase 2
Synonyms:
2.7.11.1 GC kinase Germinal center kinase MAP4K2 MEK kinase kinase 2 RAB8IP | Rab8-interacting protein
Type:
Mol. Mass.:
91551.35
Organism:
Homo sapiens (Human)
Description:
Residue:
820
  
Inhibitor
Name:
BDBM51804
Synonyms:
(3Z)-5-(4-ethoxyphenyl)-3-(3-pyridinylmethylidene)-2-furanone (3Z)-5-p-phenetyl-3-(3-pyridylmethylene)furan-2-one MLS000551916 cid_5405846
Type:
Small organic molecule
Emp. Form.:
C18H15NO3
Mol. Mass.:
293.3166
SMILES:
CCOc1ccc(cc1)C1=C\C(=C\c2cccnc2)C(=O)O1
: