Target
Mitogen-activated protein kinase kinase kinase kinase 2
Ligand
BDBM51809
Substrate
Meas. Tech.
Dose Response Confirmation Screen via Multiplex HTS Assay for Inhibitors of MEK Kinase PB1 Domains, specifically MEK5 binding to MEK Kinase 2 Mutant
EC50
5520±n/a nM
Citation
 PubChem, PC Dose Response Confirmation Screen via Multiplex HTS Assay for Inhibitors of MEK Kinase PB1 Domains, specifically MEK5 binding to MEK Kinase 2 Mutant PubChem Bioassay (2009)[AID] 
Target
Name:
Mitogen-activated protein kinase kinase kinase kinase 2
Synonyms:
2.7.11.1 GC kinase Germinal center kinase MAP4K2 MEK kinase kinase 2 RAB8IP | Rab8-interacting protein
Type:
Mol. Mass.:
91551.35
Organism:
Homo sapiens (Human)
Description:
Residue:
820
  
Inhibitor
Name:
BDBM51809
Synonyms:
MLS000591863 N-[[2,7-bis[2-(diethylamino)ethoxy]fluoren-9-ylidene]amino]picolinamide Pyridine-2-carboxylic acid [2,7-bis-(2-diethylamino-ethoxy)-fluoren-9-ylidene]-hydrazide cid_3799440
Type:
Small organic molecule
Emp. Form.:
C31H39N5O3
Mol. Mass.:
529.6731
SMILES:
[#6]-[#6]-[#7](-[#6]-[#6])-[#6]-[#6]-[#8]-c1ccc2-c3ccc(-[#8]-[#6]-[#6]-[#7](-[#6]-[#6])-[#6]-[#6])cc3\[#6](=[#7]\[#7]-[#6](=O)-c3ccccn3)-c2c1
: