Target
Mitogen-activated protein kinase kinase kinase kinase 2
Ligand
BDBM51810
Substrate
Meas. Tech.
Dose Response Confirmation Screen via Multiplex HTS Assay for Inhibitors of MEK Kinase PB1 Domains, specifically MEK5 binding to MEK Kinase 2 Mutant
EC50
30000±n/a nM
Citation
 PubChem, PC Dose Response Confirmation Screen via Multiplex HTS Assay for Inhibitors of MEK Kinase PB1 Domains, specifically MEK5 binding to MEK Kinase 2 Mutant PubChem Bioassay (2009)[AID] 
Target
Name:
Mitogen-activated protein kinase kinase kinase kinase 2
Synonyms:
2.7.11.1 GC kinase Germinal center kinase MAP4K2 MEK kinase kinase 2 RAB8IP | Rab8-interacting protein
Type:
Mol. Mass.:
91551.35
Organism:
Homo sapiens (Human)
Description:
Residue:
820
  
Inhibitor
Name:
BDBM51810
Synonyms:
4-(methoxymethyl)-6-methyl-5-nitro-2-(2-phenylethylamino)-3-pyridinecarbonitrile 4-(methoxymethyl)-6-methyl-5-nitro-2-(phenethylamino)nicotinonitrile MLS000590291 cid_3653099
Type:
Small organic molecule
Emp. Form.:
C17H18N4O3
Mol. Mass.:
326.3498
SMILES:
COCc1c(C#N)c(NCCc2ccccc2)nc(C)c1[N+]([O-])=O
: