Target
Mitogen-activated protein kinase kinase kinase kinase 2
Ligand
BDBM51813
Substrate
Meas. Tech.
Dose Response Confirmation Screen via Multiplex HTS Assay for Inhibitors of MEK Kinase PB1 Domains, specifically MEK5 binding to MEK Kinase 2 Mutant
EC50
30000±n/a nM
Citation
 PubChem, PC Dose Response Confirmation Screen via Multiplex HTS Assay for Inhibitors of MEK Kinase PB1 Domains, specifically MEK5 binding to MEK Kinase 2 Mutant PubChem Bioassay (2009)[AID] 
Target
Name:
Mitogen-activated protein kinase kinase kinase kinase 2
Synonyms:
2.7.11.1 GC kinase Germinal center kinase MAP4K2 MEK kinase kinase 2 RAB8IP | Rab8-interacting protein
Type:
Mol. Mass.:
91551.35
Organism:
Homo sapiens (Human)
Description:
Residue:
820
  
Inhibitor
Name:
BDBM51813
Synonyms:
3-(4-Methoxy-3-nitro-benzylsulfanyl)-5-methyl-4H-[1,2,4]triazole 3-[(4-methoxy-3-nitro-phenyl)methylsulfanyl]-5-methyl-1H-1,2,4-triazole 3-[(4-methoxy-3-nitrophenyl)methylthio]-5-methyl-1H-1,2,4-triazole SMR000175579 | cid_799682
Type:
Small organic molecule
Emp. Form.:
C11H12N4O3S
Mol. Mass.:
280.303
SMILES:
COc1ccc(CSc2nnc(C)[nH]2)cc1[N+]([O-])=O
: