Target
Mitogen-activated protein kinase kinase kinase kinase 2
Ligand
BDBM51817
Substrate
Meas. Tech.
Dose Response Confirmation Screen via Multiplex HTS Assay for Inhibitors of MEK Kinase PB1 Domains, specifically MEK5 binding to MEK Kinase 2 Mutant
EC50
30000±n/a nM
Citation
 PubChem, PC Dose Response Confirmation Screen via Multiplex HTS Assay for Inhibitors of MEK Kinase PB1 Domains, specifically MEK5 binding to MEK Kinase 2 Mutant PubChem Bioassay (2009)[AID] 
Target
Name:
Mitogen-activated protein kinase kinase kinase kinase 2
Synonyms:
2.7.11.1 GC kinase Germinal center kinase MAP4K2 MEK kinase kinase 2 RAB8IP | Rab8-interacting protein
Type:
Mol. Mass.:
91551.35
Organism:
Homo sapiens (Human)
Description:
Residue:
820
  
Inhibitor
Name:
BDBM51817
Synonyms:
1-(4-methoxyphenyl)-5-oxidanylidene-N-[5-(pyridin-2-ylmethylsulfanyl)-1,3,4-thiadiazol-2-yl]pyrrolidine-3-carboxamide 1-(4-methoxyphenyl)-5-oxo-N-[5-(pyridin-2-ylmethylsulfanyl)-1,3,4-thiadiazol-2-yl]pyrrolidine-3-carboxamide MLS000724906 cid_12005920
Type:
Small organic molecule
Emp. Form.:
C20H19N5O3S2
Mol. Mass.:
441.527
SMILES:
COc1ccc(cc1)N1CC(CC1=O)C(=O)Nc1nnc(SCc2ccccn2)s1
: