Target
Beta-lactamase
Ligand
BDBM51992
Substrate
Meas. Tech.
Epi-absorbance-based dose response biochemical high throughput screening assay for selective inhibitors of VIM-2 metallo-beta-lactamase
IC50
10019±n/a nM
Citation
 PubChem, PC Epi-absorbance-based dose response biochemical high throughput screening assay for selective inhibitors of VIM-2 metallo-beta-lactamase PubChem Bioassay (2009)[AID] 
Target
Name:
Beta-lactamase
Synonyms:
Beta lactamase
Type:
Enzyme Catalytic Domain
Mol. Mass.:
31513.38
Organism:
Pseudomonas aeruginosa
Description:
gi_114881106
Residue:
286
  
Inhibitor
Name:
BDBM51992
Synonyms:
3-[[(E)-[2-(4-bromobenzyl)oxybenzylidene]amino]thiocarbamoylamino]benzoic acid 3-[[[2-[(4-bromophenyl)methoxy]phenyl]methylideneamino]carbamothioylamino]benzoic acid 3-{[(2-{2-[(4-bromobenzyl)oxy]benzylidene}hydrazino)carbonothioyl]amino}benzoic acid SMR000312756 | cid_16195462
Type:
Small organic molecule
Emp. Form.:
C22H18BrN3O3S
Mol. Mass.:
484.366
SMILES:
OC(=O)c1cccc(NC(=S)NN=Cc2ccccc2OCc2ccc(Br)cc2)c1
: