Target
Amine oxidase [flavin-containing] A
Ligand
BDBM50153593
Substrate
Meas. Tech.
MAO-A Inhibitory Assay
pH
7.5±n/a
Temperature
298.15±n/a K
IC50
>100000±n/a nM
Comments
extracted
Citation
 Matsumoto, SHattori, YToyofuku, MMorimoto, SKojima, TKaku, TIto, M Cyclopropanamine compound and use thereof US Patent  US9718814 Publication Date 8/1/2017 
Target
Name:
Amine oxidase [flavin-containing] A
Synonyms:
AOFA_HUMAN MAO-A Monoamine oxidase Monoamine oxidase type A (MAO A) Monoamine oxidase type A (MAOA)
Type:
Protein
Mol. Mass.:
59689.53
Organism:
Homo sapiens (Human)
Description:
P21397
Residue:
527
  
Inhibitor
Name:
BDBM50153593
Synonyms:
CHEMBL3775351 US10414761, Example 123 US9487511, 123 US9920047, 123
Type:
Small organic molecule
Emp. Form.:
C17H22N4OS
Mol. Mass.:
330.448
SMILES:
Cc1sc(cc1[C@@H]1C[C@H]1NC1CCC1)C(=O)Nc1cnn(C)c1
: